Home > Error Installing

error installing ikernel.exe (0x2200)

error installing .net framework 1.1

error installing a service openscmanager win32 error 5

error installing adobe flash player 10.2

error installing dotnetfx.exe

error installing 2003 server vol.sys

error installing 2003 server vo.sys

error installing .net framework 3.5

error installing driver for the virtual splitcam capture device

error installing diablo 3

error installing mass effect saferun exe

error installing microsoft .net framework 3.5

error installing 3.0

error installing framework 4.0

error installing ios 6.1

error installing freebsd 7.2

error installing ikernel .exe

ikernel.exe could not be installed

error installing ikernel exe 0x10000

error installing google chrome

error installing .net framework 2.0

error installing kb923789

cannot install cs4

error installing esx 4.1

error installing ikernel.exe (0x10000) windows 7

error installing interop forms bootstrapper package

error installing hylafax freebsd

ikernel.exe download

where to install directx runtime june 2010

there was an error installing the bootloader

error installing 2003 server volprep.sys

error installing ikernel exe 0x1000

dvdx installer

error installing bay notify handler

error installing gallery core

error installing .net framework 3.0

error installing answerworks

error installing itunes on windows 7 64 bit

error installing ios 5.1

error installing flash player 10.1

error installing flash player 10.3

error installing itunes config.msi

error installing adobe flash player 10.1

error installing flash 10.1

error installing framework 2.0

error installing joomla 1.5 xampp

bzip2 ffi

error installing json 1.6.5

error installing msn

error installing ios 5.1.1

error installing itunes 10.7

error installing jfusion authentication plugin

error installing driver for the virtual splitcam

error installing concordance

error installing microsoft .net framework 1.1

error installing ios 6.0.1

how to fix java error 25099

ikernel.exe windows 7 free download

error installing ikernel.exe the system cannot find the file specified

error installing rails the json native gem

error installing activesync 4.5

ruby green threading

the installshield engine ikernel exe could not be installed windows 7

error installing dotnet framework 2.0

error installing itunes 10.6.3

error installing 5.1.1

error installing ciosv7.wad

error installing rails multi_json requires rubygems

error installing framework 1.1

error installing burning crusade

error installing ikernel.exe windvd

error installing itunes windows 7

error installing kb948109

error installing .net framework 4.0

error installing component joomla 2.5

error installing net 3.0

gem install nokogiri ubuntu

error installing norton runtime systemworks while

octave install package

error installing network magic

error installing fluent plugin elasticsearch

error installing windows 7 from usb

error installing itunes windows 7 64 bit

error installing microsoft net framework 2.0

error installing itunes microsoft.vc80.crt

error installing microsoft update subscriber

install nokogiri

how to install adobe creative suite 4

error installing pando media booster hatas

error installing dotnet framework 3.5

error installing itunes 11.0.1

`load': uninitialized constant gem::sourceindex (nameerror)

remove skype toolbar from chrome

error installing debugger: error: failed to build gem native extension.

error installing rescue and recovery boot manager

error installing systemworks

error installing rmagick gem windows

error installing the livedrv uni-pack

error installing sp2

error installing tdi device drivers 87 windows 7

error installing itunes 7.6

ruby-debug-ide rubymine

error installing ikernel.exe (0x10000) windows xp

7zip data error when installing nvidia driver

error abstractkernelcontroller error installing to real

cios38 rev 17 download

error installing rails actionpack requires rack-mount

error installing service pack 3 xp

error installing to real name=vfszip state=prereal mode=manual requiredstate=real

error installing ubuntu 12.04

error installing win2k

error installing ios 5.1.1 on ipad

error installing oniguruma gem

error installing lu file black-pre-cur

error installing to start name=jboss.web.deployment

pelco ds controlpoint

error installing gammu smsd service

error installing security update sql server 2005 service pack 3

error installing adobe flash player 10.3

itunes error occurred while installing the updates

error installing xp sp2

error installing sql 2005 service pack 3

error installing sp2 server 2003

error installing to real name=vfszip

gem install ruby debug

error installing sql2005 sp2

error installing ruby debug ide netbeans

error installing tdi device drivers aventail

error installing server 2003 sp2

error installing to parse name vfs jboss

error installing systemworks 2008

error installing framework 3.5

error installing spybot error sending request

error installing rtf parser viper

error installing sqlite3-ruby cygwin

error installing printer driver

gem install rmagick windows

error installing rails invalid gem format

error installing xp sxs.dll

error installing visual studio 2008 sp1

error installing usb driver wilife

install sqlite3 mac

error installing ruby-debug-ide-0.4.16.gem

windows vista updates not installing

gem install sqlite3 error

error installing ikernel.exe0xa00

error installing rmagick error failed to build gem native extension

error installing xp sp3

error installing sql server database engine services instance features 1639

error installing tdi device drivers 87

error: error installing ruby-debug-base19x: error: failed to build gem native extension.

error installing windows 7 sp1

error installing windows updates

error installing microsoft update subscriber on the target computer

error installing to real jboss 5

error installing windows live writer

error installing sis 5531 ide driver

abstractkernelcontroller error installing to real name=vfsfile

error installing service pack 1 vista

error installing ubuntu 10.10

error installing ubuntu 10.04

error installing ubuntu 12.10

error installing windows service using installutil.exe

error installing ubuntu 11.10

error installing to parse jboss-service.xml

ubuntu can't install rmagick 2.13.2. can't find magick-config

error installing software authorization

error installing ikernal.exe

error installing ios 6.0.2

error installing visual studio 2010 sp1

error installing windows xp on mac

error installing kb936507

error installing rmagick centos

error installing mysql2 gem

error al instalar el controlador klim

error installing zune 4.0

error installing the livedrv - unipack

error installing windows sdk 7.1

error installing windows xp sp3

error installing shaders java.lang.runtimeexception lr class is frozen

error installing ssl certificate parse error. vpn concentrator

microsoft baseline security analyzer 2.3 failed to download security update databases

error installing usbsnoop sys

error 1918 error installing odbc

error installing tdi drivers

error installing wordpress theme missing style.css

gem rcov

error installing shaders javassist.notfoundexception

error installing windows vista

error installing rmagick-2.13.1.gem

error installing windows installer 4.5

error installing ubuntu 11.04

error installing windows xp pci.sys

peachtree the installation of the pervasive database has failed

error installing teamcenter

error installing ruby-debug-ide 1.9.3

error installing tdi device driver

error installing windows installer 3.1

error installing acrobat 8.1.1

ubuntu question mark error

error installing windows 7 64 bit on mac

error installing splitcam

error installing windows server 2003 sp2

error installing windows xp setupdd.sys

wordpress fantastico vs. manual install

error installing nmas 1603

error installing xv6800

error installing xp service pack 3

 - 1